�s���{���R�[�h���͎s�撬���R�[�h,NO,�s���{����,�s�撬����,����,����_�J�i,����_�ʏ�,POI�R�[�h,�Z��,����,�ܓx,�o�x,�d�b�ԍ�,�����ԍ�,�@�l�ԍ�,�c�̖�,���p�\�j��,�J�n����,�I������,���p�\���ԓ��L����,����,�o���A�t���[���,URL,���l
172022,120000001,�ΐ쌧,�����s,�����s����,�i�i�I�V���N�V��,�i�i�I�V���N�V��,,�ΐ쌧�����s���P�]���C��25�Ԓn,,37.04333,136.96742,(0767)53-1111,,,,���ΐ��؋�,8:30,17:15,,,,https://www.city.nanao.lg.jp/index2.html,
172022,120000002,�ΐ쌧,�����s,�����s�����z�[��,�i�i�I�V�u���J�z�[��,�i�i�I�T�����C�t�v���U,,�ΐ쌧�����s�{�{��������38�Ԓn,,37.03346,136.9696,(0767)53-1160,,,,�ΐ��؋��y��,9:00,22:00,,,,https://nanaokouekikanri.or.jp/?cat=7,
172022,120000003,�ΐ쌧,�����s,���P�]���̒��ԏ�,�\�f�K�G���b�^�C�`���E�V���W���E,�\�f�K�G���b�^�C�`���E�V���W���E,,�ΐ쌧�����s���P�]��12�Ԓn,,37.04395,136.96735,,,,,���ΐ��؋��y��,0:00,23:59,,,,,
172022,120000004,�ΐ쌧,�����s,�t�H�[��������,�t�H�[�����i�i�I,�t�H�[�����i�i�I,,�ΐ쌧�����s���P��1�Ԓn,,37.04373,136.96351,(0767)52-5222,,,,���Ζ؋��y��,10:00,20:30,,,,https://www.city.nanao.lg.jp/soumu/stisetsu/04.html,
172022,120000005,�ΐ쌧,�����s,�����s�񍑏W�,�i�i�I�V�z�E�R�N�V���E�J�C�V��,,,�ΐ쌧���s��11��3�Ԓn26,,37.04429,136.98967,,,,,���ΐ��؋��y��,,,,,,,
172022,120000006,�ΐ쌧,�����s,�����s���W�,�i�i�I�V�T���m�V���E�J�C�V��,,,�ΐ쌧�����s��쒬�P��93��1�A2�Ԓn,,37.0422,137.01993,,,,,���ΐ��؋��y��,,,,,,,
172022,120000007,�ΐ쌧,�����s,�����s����W�,�i�i�I�V�T�m�V���E�J�C�V��,,,�ΐ쌧�����s���쒬����180�Ԓn1,,37.03076,136.99772,,,,,���ΐ��؋��y��,,,,,,,
172022,120000008,�ΐ쌧,�����s,�����s���ˏW�,�i�i�I�V�J���h�V���E�J�C�V��,,,�ΐ쌧�����s��쒬�C��73��5,,37.06006,137.02924,,,,,���ΐ��؋��y��,,,,,,,
172022,120000009,�ΐ쌧,�����s,�����s�a�W�,�i�i�I�V�g�m�V���E�J�C�V��,,,�ΐ쌧�����s�a������1�Ԓn��,,37.05069,137.02276,,,,,���ΐ��؋��y��,,,,,,,
172022,120000010,�ΐ쌧,�����s,�����s�����W�,�i�i�I�V�T�~�V���E�J�C�V��,,,�ΐ쌧�����s������28��59�Ԓn3,,37.04467,136.99624,,,,,���ΐ��؋��y��,,,,,,,
172022,120000011,�ΐ쌧,�����s,�����s���s�W�,�i�i�I�V�}���M���E�V���E�J�C�V��,,,�ΐ쌧�����s���s��77��36�Ԓn3,,37.04134,136.99156,,,,,���ΐ��؋��y��,,,,,,,
172022,120000012,�ΐ쌧,�����s,�����s��яW�,�i�i�I���J�o���V�V���E�J�C�V��,,,�ΐ쌧�����s��ђ��땔12�Ԓn,,36.99985,136.92939,,,,,���ΐ��؋��y��,,,,,,,
172022,120000013,�ΐ쌧,�����s,�����s���W�,�i�i�I�V�I�J�V���E�J�C�V��,,,�ΐ쌧�����s�����`��1�Ԓn,,37.05936,137.02397,,,,,���ΐ��؋��y��,,,,,,,
172022,120000014,�ΐ쌧,�����s,�����s��R�W�,�i�i�I�V�V�����}�V���E�J�C�V��,,,�ΐ쌧�����s�|������47�Ԓn,,37.0249,136.98027,,,,,���ΐ��؋��y��,,,,,,,
172022,120000015,�ΐ쌧,�����s,�����s�\�o�����c�W�,�i�i�I�V�m�g�W�}�R�E�_�V���E�J�C�V��,,,�ΐ쌧�����s�\�o�����c��120��97�Ԓn,,37.13545,137.00051,,,,,���ΐ��؋��y��,,,,,,,
172022,120000016,�ΐ쌧,�����s,�����s�\�o���ʏ��W�,�i�i�I�V�m�g�W�}�x�b�V���V���E�J�C�V��,,,�ΐ쌧�����s�\�o���ʏ���45��13�Ԓn,,37.12047,136.96735,,,,,���ΐ��؋��y��,,,,,,,
172022,120000017,�ΐ쌧,�����s,�����s���������ÏW�,�i�i�I�V�i�J�W�}�}�`�V�I�c�V���E�J�C�V��,,,�ΐ쌧�����s���������Îq��15�Ԓn,,37.08299,136.85807,,,,,���ΐ��؋��y��,,,,,,,
172022,120000018,�ΐ쌧,�����s,�����s���c�W�,�i�i�I�V�^�J�^�V���E�J�C�V��,,,�ΐ쌧�����s���c���䕔30�Ԓn1,,37.05578,136.89088,,,,,���ΐ��؋��y��,,,,,,,
172022,120000019,�ΐ쌧,�����s,�����s�������}�t�ۏW�,�i�i�I�V�i�J�W�}�}�`�J�T�V�z�V���E�J�C�V��,,,�ΐ쌧�����s�������}�t����131�Ԓn1,,37.09386,136.85098,,,,,���ΐ��؋��y��,,,,,,,
172022,120000020,�ΐ쌧,�����s,�s���{�݁i�~�i�D�N���Q�K�j,�M���E�Z�C�V�Z�c�i�~�i�D�N���Q�J�C�j,,,�ΐ쌧�����s���P��1�Ԓn�@�~�i�D�N����,,37.04332,136.96446,,,,,���ΐ��؋�,8:30,18:30,,,,,
172022,120000021,�ΐ쌧,�����s,�s���{�݁i�p�g���A�R�K�j,�M���E�Z�C�V�Z�c�i�p�g���A�R�J�C�j,,,�ΐ쌧�_�����P�Ԓn�@�p�g���A��,,37.0436,136.96323,,,,,���ΐ��؋�,8:30,18:30,,,,,
172022,120000022,�ΐ쌧,�����s,�����w�O�ɂ��킢��,�i�i�I�G�L�}�G�j�M���C�J��,,,�ΐ쌧�����s���P���P�Ԓn,,37.04375,136.96324,(0767)54-0770,,,,���ΐ��؋��y��,8:00,0:00,,,,https://patria.co.jp,
172022,120000023,�ΐ쌧,�����s,���P�n��R�~���j�e�B�Z���^�[,�~�\�M�`�N�R�~���j�e�B�Z���^�[,,,�ΐ쌧�����s��{����124�Ԓn,,37.04834,136.96133,(0767)53-0821,,,,�ΐ��؋��y��,8:30,17:15,�N���N�n12/29�`1/3�x��,,,,
172022,120000024,�ΐ쌧,�����s,���P�]�n��R�~���j�e�B�Z���^�[,�\�f�K�G�`�N�R�~���j�e�B�Z���^�[,,,�ΐ쌧�����s�����꒚��145�Ԓn��1,,37.0469,136.97101,(0767)52-1369,,,,���ΐ��؋��y,8:30,17:15,�N���N�n12/29�`1/3�x��,,,,
172022,120000025,�ΐ쌧,�����s,���c�n��R�~���j�e�B�Z���^�[,�g�N�_�`�N�R�~���j�e�B�Z���^�[,,,�ΐ쌧�����s���p������3�Ԓn1,,37.01247,136.94905,(0767)57-1252,,,,���ΐ��؋�,8:30,17:15,�N���N�n12/29�`1/3�x��,,,http://tokuda-m-k.jp/,
172022,120000026,�ΐ쌧,�����s,��c���n��R�~���j�e�B�Z���^�[,���^�S�E�`�N�R�~���j�e�B�Z���^�[,,,�ΐ쌧�����s�{�{��������38�Ԓn,,37.03374,136.96945,(0767)52-5240,,,,�ΐ��؋��y��,8:30,17:15,�N���N�n12/29�`1/3�x��,,,,
172022,120000027,�ΐ쌧,�����s,�����n��R�~���j�e�B�Z���^�[,�q�K�V�~�i�g�`�N�R�~���j�e�B�Z���^�[,,,�ΐ쌧�����s�������g��2�Ԓn3,,37.04835,136.99761,(0767)52-5319,,,,���ΐ��؋�,8:30,17:15,�N���N�n12/29�`1/3�x��,,,,
172022,120000028,�ΐ쌧,�����s,�����n��R�~���j�e�B�Z���^�[,�j�V�~�i�g�`�N�R�~���j�e�B�Z���^�[,,,�ΐ쌧�����s�Ì������R��1�Ԓn,,37.05774,136.95045,(0767)52-2623,,,,�ΐ��؋��y,8:30,17:15,�N���N�n12/29�`1/3�x��,,,,
172022,120000029,�ΐ쌧,�����s,�΍�n��R�~���j�e�B�Z���^�[,�C�V�U�L�`�N�R�~���j�e�B�Z���^�[,,,�ΐ쌧�����s�΍蒬�\��7��1�n,,37.09678,136.93001,(0767)62-2835,,,,�ΐ��؋��y,8:30,17:15,�N���N�n12/29�`1/3�x��,,,,
172022,120000030,�ΐ쌧,�����s,�a�q�n��R�~���j�e�B�Z���^�[,���N���`�N�R�~���j�e�B�Z���^�[,,,�ΐ쌧�����s�a�q���N��15��3,,37.08695,136.91628,(0767)62-2084,,,,���ΐ��؋��y,8:30,17:15,�N���N�n12/29�`1/3�x��,,,,
172022,120000031,�ΐ쌧,�����s,�k��ےn��R�~���j�e�B�Z���^�[,�L�^�I�I�m�~�`�N�R�~���j�e�B�Z���^�[,,,�ΐ쌧�����s�����E��23�Ԓn��2,,37.04097,137.04617,(0767)59-1124,,,,���ΐ��؋�,8:30,17:15,�N���N�n12/29�`1/3�x��,,,,
172022,120000032,�ΐ쌧,�����s,���ےn��R�~���j�e�B�Z���^�[,�~�i�~�I�I�m�~�`�N�R�~���j�e�B�Z���^�[,,,�ΐ쌧�����s���蒬�֏�암342�Ԓn8,,36.98317,137.04893,(0767)59-1111,,,,���ΐ��؋�,8:30,17:15,�N���N�n12/29�`1/3�x��,,,,
172022,120000033,�ΐ쌧,�����s,��R�n��R�~���j�e�B�Z���^�[,�T�L���}�`�N�R�~���j�e�B�Z���^�[,,,�ΐ쌧�����s�L�Y������13�Ԓn2,,37.0972,137.0465,(0767)58-1111,,,,���ΐ��؋�,8:30,17:15,�N���N�n12/29�`1/3�x��,,,https://sakiyamachiku.com/community-center/,
172022,120000034,�ΐ쌧,�����s,���K�n��R�~���j�e�B�Z���^�[,�^�J�V�i�`�N�R�~���j�e�B�Z���^�[,,,�ΐ쌧�����s�������z��55�Ԓn,,37.03529,136.90123,(0767)57-3239,,,,���ΐ��؋�,8:30,17:15,�N���N�n12/29�`1/3�x��,,,http://takashinacomcen.com/,
172022,120000035,�ΐ쌧,�����s,�c�ߕl�n��R�~���j�e�B�Z���^�[,�^�c���n�}�`�N�R�~���j�e�B�Z���^�[,,,�ΐ쌧�����s�_�g���֕�24�Ԓn,,37.06347,136.89535,(0767)68-3336,,,,���ΐ��؋��y,8:30,17:15,�N���N�n12/29�`1/3�x��,,,http://www.770sunbeam.jp/,
172022,120000036,�ΐ쌧,�����s,�c�ߕl�n��R�~���j�e�B�Z���^�[���n����,�^�c���n�}�`�N�R�~���j�e�B�Z���^�[�\�E�}�u���J��,,,�ΐ쌧�����s�ɋv��������2�Ԓn,,37.03138,136.88946,(0767)68-3525,,,,�ΐ��؋��y,8:30,17:15,�N���N�n12/29�`1/3�x��,,,,
172022,120000037,�ΐ쌧,�����s,�c�ߕl�n��R�~���j�e�B�Z���^�[�����蕪��,�^�c���n�}�`�N�R�~���j�e�B�Z���^�[�J�i�K�T�L�u���J��,,,�ΐ쌧�����s��Ò��N��31�Ԓn,,37.06783,136.85348,(0767)68-3114,,,,���ΐ��؋�,8:30,17:15,�N���N�n12/29�`1/3�x��,,,,
172022,120000038,�ΐ쌧,�����s,�����n��R�~���j�e�B�Z���^�[,�i�J�W�}�`�N�R�~���j�e�B�Z���^�[,,,�ΐ쌧�����s�����������b��170�Ԓn,,37.12142,136.85468,(0767)66-0330,,,,���ΐ��؋��y,8:30,17:15,�N���N�n12/29�`1/3�x��,,,https://www.noto-nakajima.jp/,
172022,120000039,�ΐ쌧,�����s,�����n��R�~���j�e�B�Z���^�[���ݕ���,�i�J�W�}�`�N�R�~���j�e�B�Z���^�[�j�V�M�V�u���J��,,,�ΐ쌧�����s���������q�^��18�Ԓn1,,37.14219,136.8724,(0767)66-0170,,,,���ΐ��؋�,8:30,17:15,�N���N�n12/29�`1/3�x��,,,,
172022,120000040,�ΐ쌧,�����s,�����n��R�~���j�e�B�Z���^�[�ߑŕ���,�i�J�W�}�`�N�R�~���j�e�B�Z���^�[�i�^�E�`�u���J��,,,�ΐ쌧�����s���������J���ւ�98�Ԓn,,37.15042,136.81161,(0767)66-0099,,,,���ΐ��؋�,8:30,17:15,�N���N�n12/29�`1/3�x��,,,,
172022,120000041,�ΐ쌧,�����s,�����n��R�~���j�e�B�Z���^�[�F�ؕ���,�i�J�W�}�`�N�R�~���j�e�B�Z���^�[�N�}�L�u���J��,,,�ΐ쌧�����s�������㒬����113�Ԓn,,37.12674,136.84347,(0767)66-1567,,,,���ΐ��؋�,8:30,17:15,�N���N�n12/29�`1/3�x��,,,,
172022,120000042,�ΐ쌧,�����s,�����n��R�~���j�e�B�Z���^�[�L�앪��,�i�J�W�}�`�N�R�~���j�e�B�Z���^�[�g���J���u���J��,,,�ΐ쌧�����s�������L�c������13�Ԓn��1,,37.10086,136.8338,(0767)66-6799,,,,���ΐ��؋�,8:30,17:15,�N���N�n12/29�`1/3�x��,,,,
172022,120000043,�ΐ쌧,�����s,�����n��R�~���j�e�B�Z���^�[�}�t�ە���,�i�J�W�}�`�N�R�~���j�e�B�Z���^�[�J�T�V�z�u���J��,,,�ΐ쌧�����s�������}�t�~��63�Ԓn,,37.0954,136.85771,(0767)66-1778,,,,���ΐ��؋�,8:30,17:15,�N���N�n12/29�`1/3�x��,,,,
172022,120000044,�ΐ쌧,�����s,�\�o���n��R�~���j�e�B�Z���^�[,�m�g�W�}�`�N�R�~���j�e�B�Z���^�[,,,�ΐ쌧�����s�\�o�����c����8�Ԓn1,,37.12625,136.99655,(0767)84-1110,,,,���ΐ��؋�,8:30,17:15,�N���N�n12/29�`1/3�x��,,,https://notojima-chiiki.com/,
172022,120000046,�ΐ쌧,�����s,�R�����q���ی㎙���N���u,�T���m�b�R�z�E�J�S�W�h�E�N���u,,,�ΐ쌧�����s�R�����c��34�Ԓn,,37.04214,136.97372,(0767)52-1443,,,,,,,,,,,
172022,120000047,�ΐ쌧,�����s,�����s��������,�i�i�I�V�W�h�E�R�E�G��,,,�ΐ쌧�����s�������l�c7��67�Ԓn,,37.10942,136.85431,,,,,,,,,,,,
172022,120000048,�ΐ쌧,�����s,���E�G�厙���V���n,�}���G�����W�h�E���E�G���`,,,�ΐ쌧�����s�唑��36��24�Ԓn1,,36.96059,137.05128,,,,,,,,,,,,
172022,120000049,�ΐ쌧,�����s,���?�q�ǂ��̍L��,�^�L�m�V���R�h���m�q���o,,,�ΐ쌧�����s�F�����V��50�Ԓn1,,36.99458,136.98267,,,,,,,,,,,,
172022,120000050,�ΐ쌧,�����s,�����q�ǂ��̍L��,�I�N�n���R�h���m�q���o,,,�ΐ쌧�����s����������56�Ԓn,,37.07245,136.91409,,,,,,,,,,,,
172022,120000051,�ΐ쌧,�����s,�r�蒬�����q�V���n,�C�P�U�L�}�`�W�h�E���E�G���`,,,�ΐ쌧�����s�r�蒬����26�Ԓn,,37.03546,136.91167,,,,,,,,,,,,
172022,120000052,�ΐ쌧,�����s,�V�ے������V���n,�V���{�}�`�W�h�E���E�G���`,,,�ΐ쌧�����s�V�ے�2��14�Ԓn,,37.06827,136.93798,,,,,,,,,,,,
172022,120000053,�ΐ쌧,�����s,�����������V���n,�t�W�n�V�}�`�W�h�E���E�G���`,,,�ΐ쌧�����s����������16�Ԓn1,,37.03899,136.96325,,,,,,,,,,,,
172022,120000054,�ΐ쌧,�����s,��ђ��q�ǂ��̍L��,���J�o���V�}�`�R�h���m�q���o,,,�ΐ쌧�����s��ђ��땔13�Ԓn,,36.9996,136.92914,,,,,,,,,,,,
172022,120000055,�ΐ쌧,�����s,���c���q�ǂ��̍L��,�g�N�_�}�`�R�h���m�q���o,,,�ΐ쌧�����s�ѐ쒬101��72�Ԓn20,,37.00905,136.93331,,,,,,,,,,,,
172022,120000056,�ΐ쌧,�����s,���S�������V���n,�}�b�g�E�}�`�W�h�E���E�G���`,,,�ΐ쌧�����s���S��3��17�Ԓn,,37.06561,136.93876,,,,,,,,,,,,
172022,120000057,�ΐ쌧,�����s,�S�C���q�ǂ��̍L��,�h�E�~�}�`�R�h���m�q���o,,,�ΐ쌧�����s�����m��1�Ԓn3,,37.04588,137.04741,,,,,,,,,,,,
172022,120000058,�ΐ쌧,�����s,�����s���������g�C��,�i�i�I�V�W�h�E�R�E�G���g�C��,,,�ΐ쌧�����s�������l�c7��67�Ԓn,,37.1094,136.85468,,,,,,,,,,,,
172022,120000061,�ΐ쌧,�����s,�����ۈ牀,�i�J�W�}�z�C�N�G��,,,�ΐ쌧�����s��������������39�Ԓn��1,,37.11674,136.85223,(0767)66-1231,,,,���E�΁E���E�؁E���E�y,7:00,19:00,,,,,
172022,120000062,�ΐ쌧,�����s,���N���i�Z���^�[�A�X����,�P���R�E�]�E�V���Z���^�[�A�X����,,,�����s���c������10�Ԓn,,37.05569,136.89627,0767-68-6788,,,,���Ζ؋��y��,10:00,21:00,"���j�����j���̏ꍇ�͗��p�B�������A�������͎g�p�s�B
12/31,1/1�͎g�p�s�B",,,http://www.city.nanao.lg.jp/kenkou/shisetsu/07.html,
172022,120000063,�ΐ쌧,�����s,�������N�����Z���^�[�����₩,�i�J�W�}�P���R�E�t�N�V�Z���^�[,,,�����s�������͍�k��31�Ԓn,,37.10694,136.84742,,,,,���ΐ��؋�,8:30,17:15,12/28�`1/3�͎g�p�s��,,,,
172022,120000064,�ΐ쌧,�����s,�����s���S�s�X�n�ό��𗬃Z���^�[,�i�i�I�V�`���E�V���V�K�C�`�J���R�E�R�E�����E�Z���^�[,�ԉł̂���,,�ΐ쌧�����s�n�o���c��49,,37.0471,136.96176,(0767)53-8473,,,,���ΐ��؋��y���j,9:00,17:00,�N���N�n12/29�`1/3�A�W���ւ����ԋx��,,,http://hanayomenorenkan.jp/,
172022,120000065,�ΐ쌧,�����s,���̉w������,�~�`�m�G�L�C�I��,,,�ΐ쌧�����s���������J��3-1,,37.02851,137.04713,(0767)59-1415,,,,���ΐ����y���j,10:00,17:00,�N���N�n12/29�`1/3�x��,,,https://www.michi-no-eki.jp/stations/view/19252,
172022,120000066,�ΐ쌧,�����s,����PARK����,�C�C�p�[�N�i�i�I,�n�[�g�����h�q���Yin�\�o��������,,�ΐ쌧�����s���������J��3-1,,37.02746,137.04577,(0767)32-3800,,,,���ΐ��؋��y���j,,,�v�����ɂ��,,,https://hl-hills.jp/iori/,
172022,120000067,�ΐ쌧,�����s,�a�q���򂨍Ղ���,���N���I���Z���I�}�c���J�C�J��,,,�ΐ쌧�����s�a�q��2-13-1,,37.08685,136.91869,(0767)62-4332,,,,���ΐ��؋��y���j,9:00,17:00,��2�E4���A�N���N�n�@�x��,,,https://wakura-omatsuri.com/,
172022,120000068,�ΐ쌧,�����s,�����s�a�q����ό��𗬃Z���^�[,�i�i�I�V���N���I���Z���J���R�E�R�E�����E�Z���^�[,�a�q���򑍓�,,�ΐ쌧�����s�a�q������5-1,,37.08896,136.91641,(0767)62-2221,,,,���ΐ��؋��y���j,7:00,21:00,����25���i�y���̏ꍇ�A�����j���j�x��,,,http://www.wakura.co.jp/index.html,
172022,120000069,�ΐ쌧,�����s,��������p�[�N,���b�^���p�[�N,,,�ΐ쌧�����s�a�q���Ђ΂�1-1,,37.088,136.92353,(0767)62-2221,,,,���ΐ��؋��y���j,0:00,23:59,������7�F00�`19�F00,,,,
172022,120000070,�ΐ쌧,�����s,�����s�a�q����^�������i���ړI�O���E���h�j,�i�i�I�V���N���I���Z���E���h�E�R�E�G���i�^���N�e�L�O���E���h�j,,,�ΐ쌧�����s�΍蒬�`��32-1,,37.08692,136.93009,(0767)62-0999,,,,�ΐ��؋��y���j,8:00,18:00,�N���N�n12/29�`1/3�x��,,,http://www.spo-camp.com/,
172022,120000071,�ΐ쌧,�����s,�����s�a�q����^�������i���b�g�n�[�o�[�j,�i�i�I�V���N���I���Z���E���h�E�R�E�G���i���b�g�n�[�o�[�j,,,�ΐ쌧�����s�΍蒬�`��32-1,,37.08606,136.92816,(0767)62-0900,,,,���ΐ��؋��y���j,8:00,18:00,�N���N�n12/29�`1/3�x��,,,,
172022,120000072,�ΐ쌧,�����s,�����s�a�q����^�������i�e�j�X�R�[�g�j,�i�i�I�V���N���I���Z���E���h�E�R�E�G���i�e�j�X�R�[�g�j,,,�ΐ쌧�����s�΍蒬���2,,37.08236,136.933,(0767)62-0999,,,,�ΐ��؋��y���j,6:00,21:00,�N���N�n12/29�`1/3�x��,,,http://www.spo-camp.com/,
172022,120000073,�ΐ쌧,�����s,�Ȃ����܉��c�F���򂢂₵�̓�,�i�J�W�}�T���^�q�R�I���Z���C���V�m��,,,�ΐ쌧�����s���������q����116,,37.14431,136.87398,(0767)66-8686,,,,�����؋��y���j,10:30,20:30,�V�^�R���i�E�C���X�����Ǒ΍�Ƃ��ĉc�Ǝ��ԓ��ύX���Ă���ꍇ����,,,https://www.noto-omakidai.com/spa/,
172022,120000074,�ΐ쌧,�����s,�����h�ɔ\�o���q��,�R�N�~���V���N�V���m�g�I�}�L�_�C,,,�ΐ쌧�����s���������q�䕔55,,37.14364,136.87519,(0767)66-1121,,,,���ΐ��؋��y���j,15:00,10:00,,,,https://www.noto-omakidai.com/,
172022,120000075,�ΐ쌧,�����s,���̉w�Ȃ����܃��}����,�~�`�m�G�L�i�J�W�}���}���g�E�Q,,,�ΐ쌧�����s�����������j��1-19,,37.13077,136.86342,(0767)66-0155,,,,���ΐ��؋��y���j,7:00,19:30,1/1�`1/3�x��,,,https://www.michi-no-eki.jp/stations/view/19255,
172022,120000076,�ΐ쌧,�����s,�\�o�����I�[�g�L�����v��,�m�g�i�J�W�}�I�[�g�L�����v�W���E,,,�ΐ쌧�����s���������Y�A�[�Y,,37.13707,136.89016,(0767)53-8424,,,,,,,�x�~��,,,,
172022,120000077,�ΐ쌧,�����s,�\�o���𗬎s��,�m�g�W�}�R�E�����E�C�`�o,���̉w�̂Ƃ���,,�ΐ쌧�����s�\�o�����c��122-14,,37.13727,136.9979,(0767)84-0225,,,,���ΐ��؋��y���j,9:00,17:00,"�N���N�n12/29�`1/1�A12/1�`3/20�܂ł̖��T�ؗj�x��
�V�^�R���i�E�C���X�����Ǒ΍�Ƃ��ĉc�Ǝ��ԓ��ύX���Ă���ꍇ����",,,https://notojima-michinoeki.com/,
172022,120000078,�ΐ쌧,�����s,�\�o���Ƒ����s��,�m�g�W�}�J�]�N�����R�E����,�\�o���Ƒ����s��We�����h,,�ΐ쌧�����s�\�o�����c���q�R,,37.15044,136.97354,(0767)84-1880,,,,���ΐ��؋��y���j,,,"�v�����ɂ��
12���`2���͓~�G�x��",,,https://welandcamp.jp/,
172022,120000079,�ΐ쌧,�����s,�Ђ�����艷�򓇂̓�,�q���b�R���I���Z���V�}�m��,,,�ΐ쌧�����s�\�o�����g������29-1,,37.11944,136.99693,(0767)84-0033,,,,���ΐ��ؓy���j,10:00,21:00,"�����ŏI���j���x����
�V�^�R���i�E�C���X�����Ǒ΍�Ƃ��ĉc�Ǝ��ԓ��ύX���Ă���ꍇ����",,,http://user.notojima.jp/shimanoyu/top.html,
172022,120000080,�ΐ쌧,�����s,�����s�\�o���O���E���h,�i�i�I�V�m�g�W�}�O���E���h,,,�ΐ쌧�����s�\�o�����c���n�t�J��31-1,,37.12266,136.99678,(0767)62-0999,,,,�ΐ��؋��y���j,8:00,21:00,�N���N�n12/29�`1/3�x��,,,http://www.spo-camp.com/,
172022,120000081,�ΐ쌧,�����s,�\�o���}�����p�[�N�C������,�m�g�W�}�}�����p�[�N�E�~�]�N�R�E�G��,,,�ΐ쌧�����s�\�o�����g��,,37.11887,136.99835,(0767)62-0999,,,,�ΐ��؋��y���j,8:00,19:00,,,,http://www.spo-camp.com/,
172022,120000082,�ΐ쌧,�����s,�\�o���K���X�H�[,�m�g�W�}�K���X�R�E�{�E,,,�ΐ쌧�����s�\�o�����c��122-53,,37.1376,136.99861,(0767)84-1180,,,,���ΐ��؋��y���j,9:00,17:00,�N���N�n�x��,,,https://notojimaglass.com/,
172022,120000084,�ΐ쌧,�����s,�����}�����p�[�N,�i�i�I�}�����p�[�N,�����}�����p�[�N,,�ΐ쌧�����s�{�����n��,,37.04847,136.96999,,,,,���ΐ��؋��y��,0:00,0:00,,,,,
172022,120000085,�ΐ쌧,�����s,���p����,�r�����R�E�G��,�r�����R�E�G��,,�ΐ쌧�����s��c�V���n��,,37.0484,136.98242,,,,,���ΐ��؋��y��,0:00,0:00,,,,,
172022,120000086,�ΐ쌧,�����s,�݂ȂƏ�����,�~�i�g�V���E�R�E�G��,�~�i�g�V���E�R�E�G��,,�ΐ쌧�����s��c�V���n��,,37.0488,136.97725,,,,,���ΐ��؋��y��,0:00,0:00,,,,,
172022,120000087,�ΐ쌧,�����s,�������ӂꂠ�����C�Z���^�[,�^�l�}�`�t���A�C�P���V���E�Z���^�[,,,�ΐ쌧�����s����������269�Ԓn3,,36.98503,136.97885,,,,,,,,,,,,
172022,120000088,�ΐ쌧,�����s,�L��ӂ邳�ƃZ���^�[,�g���J���t���T�g�Z���^�[,,,�ΐ쌧�����s�������L�c���}��1�Ԓn,,37.10036,136.83441,,,,,,,,,,,,
172022,120000089,�ΐ쌧,�����s,���Y���邨������������,�i�K�E���E���I�C�R�E�G���`���N�o�C�V��,,,�ΐ쌧�����s���������Y�i��111�Ԓn,,37.13595,136.89832,,,,,,,,,,,,
172022,120000090,�ΐ쌧,�����s,�V�_�R�e�������g�C��,�e���W�����}�V���X�C�R�E�G���g�C��,,,�ΐ쌧�����s�O����13��16�b,,37.05438,136.87625,,,,,���ΐ��؋��y��,,,,,,,
172022,120000091,�ΐ쌧,�����s,�߂̗������g�C��,�c���m�T�g�R�E�G���g�C��,,,�ΐ쌧�����s�M��������54�Ԓn,,37.07283,136.90061,,,,,���ΐ��؋��y��,9:00,17:00,,,,,
172022,120000092,�ΐ쌧,�����s,�ԉY�_�������g�C��,�A�J�E���m�E�\���R�E�G���g�C��,,,�ΐ쌧�����s�ԉY���m��52�Ԓn1,,37.06106,136.93676,,,,,���ΐ��؋��y��,,,,,,,
172022,120000093,�ΐ쌧,�����s,�{�O�_�������g�C��,�~���m�}�G�m�E�\���R�E�G���g�C��,,,�ΐ쌧�����s�������{�O�b��10�Ԓn,,37.12896,136.83364,,,,,���ΐ��؋��y��,,,,,,,
172022,120000094,�ΐ쌧,�����s,�c�ߕl�쒹����,�^�c���n�}���`���E�R�E�G��,,,�ΐ쌧�����s�c�ߕl��2��1�Ԓn,,37.06831,136.88766,,,,,���ΐ��؋��y��,,,,,,,
172022,120000095,�ΐ쌧,�����s,���q������,�I�}�L�e�C�����E�W���E,,,�ΐ쌧�����s���������q����116�Ԓn,,37.14495,136.87342,,,,,���ΐ��؋��y��,,,,,,,
172022,120000096,�ΐ쌧,�����s,�����t�����[�p�[�N�̂Ɨ��m��,�i�i�I�t�����[�p�[�N�m�g�����m�N�j,,,�ΐ쌧�����s�׌����n���X�C�n��,,37.03367,136.92906,(0767)54-0300,,,,���ΐ����y��,9:00,17:00,12/29�`1/3�͏I�����p�s�B,,,http://www.notorannokuni.com/,
172022,120000097,�ΐ쌧,�����s,�\�o���̌��_���{��,�m�g�W�}�^�C�P���m�E�G���V�Z�c,,,�ΐ쌧�����s�\�o����蒬,,37.12824,137.04984,(0767)84-8077,,,,���ΐ��؋��y��,,,"�̌�����{�݁@9���`17���܂�
�I�[�g�L�����v�@11���`����10���܂�",,,,
172022,120000098,�ΐ쌧,�����s,�����쐅����,�t�W�m�Z���C�X�C�R�E�G��,,,�ΐ쌧�����s����������19��38��7�n,,37.14525,136.82943,(0767)66-2500,,,,���ΐ��؋��y��,,,,,,,
172022,120000099,�ΐ쌧,�����s,聃|�P�b�g�p�[�N�������i�˂�t�B�b�V���O�p�[�N�j,�l���|�P�b�g�p�[�N�`���N�o�C�V��,,,�ΐ쌧�����s�\�o��聒�����43�Ԓn1,,37.13295,136.9292,,,,,���ΐ��؋��y��,,,,,,,
172022,120000100,�ΐ쌧,�����s,��ےn����Y�i�����{�݁i��킭�킭�s��j,�I�I�m�~�`�N�g�N�T���q���`���N�o�C�V�Z�c,,,�ΐ쌧�����s�������P�J��3�Ԓn1,,37.02819,137.04697,(0767)59-1415,,,,,,,,,,,
172022,120000101,�ΐ쌧,�����s,�����n��_�Y���������H�{��,�A�\�E�`�N�m�E�T���u�c�V�����J�R�E�V�Z�c,,,�ΐ쌧�����s�������P�n�P��19�̍b��8��2�Ԓn,,37.01293,137.02293,(0767)59-8331,,,,,,,,,,,
172022,120000102,�ΐ쌧,�����s,�����s���ݒn�������s��,�i�i�I�V�R�E�Z�c�`�z�E�I���V�E���C�`�o,,,�ΐ쌧�����s��c��111��25�Ԓn,,37.05549,136.99861,(0767)53-4433,,,,,,,,,,https://nanaoichiba.jp/,
172022,120000103,�ΐ쌧,�����s,�ߑŔ_�ы��ƍ���҃Z���^�[,�i�^�E�`�m�E�����M���J�R�E���C�V���Z���^�[,,,�ΐ쌧�����s����������3��122��1,,37.14349,136.81785,,,,,,,,,,,,
172022,120000104,�ΐ쌧,�����s,�����\�����P�Z���^�[,�j�V�V���R�E�]�E�J�C�[���Z���^�[,,,�ΐ쌧�����s�������֕�164�Ԓn,,37.04323,136.89308,,,,,,,,,,,,
172022,120000105,�ΐ쌧,�����s,���J���c�_�Z���^�[,�j�V���`�G�C�m�E�Z���^�[,,,�ΐ쌧�����s���������J���^��45�ԍb�n,,37.15709,136.81197,,,,,,,,,,,,
172022,120000106,�ΐ쌧,�����s,��c���ӂꂠ���Z���^�[,���^�}�`�t���A�C�Z���^�[,,,�ΐ쌧�����s��c��3��226�Ԓn,,37.03592,136.97838,,,,,,,,,,,,
172022,120000107,�ΐ쌧,�����s,�����ʏ��W�,�i�J�W�}�x�b�V���V���E�J�C�V��,,,�ΐ쌧�����s�������ʏ�6��69�Ԓn,,37.16463,136.83823,,,,,,,,,,,,
172022,120000108,�ΐ쌧,�����s,�\�o����葽�ړI�W�,�m�g�W�}�m�U�L�^���N�e�L�V���E�J�C�V��,,,�ΐ쌧�����s�\�o����蒬100��24�Ԓn,,37.12838,137.04573,,,,,,,,,,,,
172022,120000109,�ΐ쌧,�����s,�\�o�����֑��ړI�W�,�m�g�W�}���Z�L�^���N�e�L�V���E�J�C�V��,,,�ΐ쌧�����s�\�o�����֒��m��42�Ԓn��,,37.0405,136.94431,,,,,,,,,,,,
172022,120000110,�ΐ쌧,�����s,�\�o�����c���ړI�W�,�m�g�W�}�R�E�_�^���N�e�L�V���E�J�C�V��,,,�ΐ쌧�����s�\�o�����c��120��92�Ԓn,,37.1355,137.00068,,,,,,,,,,,,
172022,120000111,�ΐ쌧,�����s,�͓����ړI���C�Z���^�[,�J���`�^���N�e�L�P���V���E�Z���^�[,,,�ΐ쌧�����s�������͓����b��62�Ԓn,,37.15852,136.81853,,,,,,,,,,,,
172022,120000112,�ΐ쌧,�����s,����_�����ړI�Z���^�[,���V�T�L�m�E�\���^���N�e�L�Z���^�[,,,�ΐ쌧�����s�����J��30�Ԓn,,37.02261,137.04965,,,,,,,,,,,,
172022,120000113,�ΐ쌧,�����s,�����_�����ړI�Z���^�[,�V���g���m�E�\���^���N�e�L�Z���^�[,,,�ΐ쌧�����s�����A��54�Ԓn,,37.05609,137.04954,,,,,,,,,,,,
172022,120000114,�ΐ쌧,�����s,�]���_�����ړI�Z���^�[,�G�m�g�}���m�E�\���^���N�e�L�Z���^�[,,,�ΐ쌧�����s�]�����k��17�Ԓn,,37.06614,137.05168,,,,,,,,,,,,
172022,120000115,�ΐ쌧,�����s,���ؔ_�����ړI�Z���^�[,�I�I�m�M�m�E�\���^���N�e�L�Z���^�[,,,�ΐ쌧�����s���ؒ��C��48�Ԓn1,,37.08105,137.05037,,,,,,,,,,,,
172022,120000116,�ΐ쌧,�����s,�O���_������,�T���K�m�E�\���R�E�G��,,,�ΐ쌧�����s�\�o���c�K���֕�46�Ԓn1,,37.147,136.90751,,,,,���ΐ��؋��y��,,,,,,,
172022,120000118,�ΐ쌧,�����s,�F�ڔ_�������g�C��,�G�m���m�E�\���R�E�G���g�C��,,,�ΐ쌧�����s�\�o���F�ڒ����`�����n,,37.15638,137.04841,,,,,���ΐ��؋��y��,,,,,,,
172022,120000119,�ΐ쌧,�����s,联_������,�l���m�E�\���R�E�G��,,,�ΐ쌧�����s�\�o��聒�8��31�Ԓn1,,37.1294,136.93151,,,,,���ΐ��؋��y��,,,,,,,
172022,120000120,�ΐ쌧,�����s,���Y���邨�������g�C��,�i�K�E���E���I�C�R�E�G���g�C��,,,�ΐ쌧�����s���������Y�i��111�Ԓn,,37.13589,136.89868,,,,,���ΐ��؋��y��,,,,,,,
172022,120000121,�ΐ쌧,�����s,�F�ڒn�拙�D�ۑS�C���{��,�G�m���`�N�M���Z���z�[���V���E���V�Z�c,,,�ΐ쌧�����s�\�o���F�ڒ�,,37.15664,137.05071,,,,,,,,,,,,
172022,120000122,�ΐ쌧,�����s,�v�ؒn�拙�D�ۑS�C���{��,�N�L�`�N�M���Z���z�[���V���E���V�Z�c,,,�ΐ쌧�����s�\�o���v�ؒ��I,,37.15106,136.90886,,,,,,,,,,,,
172022,120000123,�ΐ쌧,�����s,���c�n�拙�D�ۑS�C���{��,�R�E�_�`�N�M���Z���z�[���V���E���V�Z�c,,,�ΐ쌧�����s�\�o�����c��,,37.13641,137.00018,,,,,,,,,,,,
172022,120000124,�ΐ쌧,�����s,�{�]�n�拙�D�ۑS�C���{��,�X�\�`�N�M���Z���z�[���V���E���V�Z�c,,,�ΐ쌧�����s�\�o���{�]��,,37.10372,136.96231,,,,,,,,,,,,
172022,120000125,�ΐ쌧,�����s,�ʒn�拙�D���Ɨp��ƕۊǎ{��,�g�I���`�N�M���Z���M���M���E���E�T�M���E�z�J���V�Z�c,,,�ΐ쌧�����s�\�o���ʒ��`,,37.14023,136.90425,,,,,,,,,,,,
172022,120000126,�ΐ쌧,�����s,���n�拙�D�ۑS�C���{��,�m�U�L�`�N�M���Z���z�[���V���E���V�Z�c,,,�ΐ쌧�����s�\�o����蒬,,37.12618,137.04741,,,,,,,,,,,,
172022,120000127,�ΐ쌧,�����s,�c�ꃖ�Y�n�拙�D���Ɨp��ƕۊǎ{��,�o�K�E���`�N�M���Z���M���M���E���E�T�M���E�z�J���V�Z�c,,,�ΐ쌧�����s�\�o���c�ꃖ�Y��,,37.16678,137.03462,,,,,,,,,,,,
172022,120000128,�ΐ쌧,�����s,�c�ꃖ�Y�n�拙�D�ۑS�C���{��,�o�K�E���`�N�M���Z���z�[���V���E���V�Z�c,,,�ΐ쌧�����s�\�o���c�ꃖ�Y��,,37.16735,137.03584,,,,,,,,,,,,
172022,120000129,�ΐ쌧,�����s,���Y�n�拙�D�ۑS�C���{��,�n���m�E���`�N�M���Z���z�[���V���E���V�Z�c,,,�ΐ쌧�����s�\�o�����Y��,,37.11573,136.93743,,,,,,,,,,,,
172022,120000130,�ΐ쌧,�����s,�Ȓn�拙�D���Ɨp��ƕۊǎ{��,�}�K���`�N�M���Z���M���M���E���E�T�M���E�z�J���V�Z�c,,,�ΐ쌧�����s�\�o���Ȓ�11-1-8,,37.14082,136.99044,,,,,,,,,,,,
172022,120000131,�ΐ쌧,�����s,������N�Y���H�{��,�R�E�`�N�Y�J�R�E�V�Z�c,,,�ΐ쌧�����s�R�蒬�i��45�Ԓn,,36.97788,137.01436,,,,,,,,,,,,
172022,120000132,�ΐ쌧,�����s,�_�@��i�[�Ɍ��l�M���n������Ə�,�m�E�L�O�J�N�m�E�R�P���l�M�V���E�J�N�`���E�Z�C�T�M���E�W���E,,,�ΐ쌧�����s������������22�Ԓn,,37.10968,136.8646,,,,,,,,,,,,
172022,120000133,�ΐ쌧,�����s,���I���������p��B�i�[��,�I�O���}�`�L���E�h�E�����E�L�J�C�J�N�m�E�R,,,�ΐ쌧�����s���I������48�Ԓn,,37.01956,137.01344,,,,,,,,,,,,
172022,120000134,�ΐ쌧,�����s,���m�Y�n�搅�g�׎J�{��,�n���m�E���`�N�~�Y�A�Q�j�T�o�L�V�Z�c,,,�ΐ쌧�����s�\�o�����Y��,,37.11612,136.93687,,,,,,,,,,,,
172022,120000135,�ΐ쌧,�����s,�ԉY�n��h�����呀�쎺,�A�J�E���`�N�{�E�`���E�X�C�����\�E�T�V�c,,,�ΐ쌧�����s�ԉY��,,37.0662,136.94123,,,,,,,,,,,,
172022,120000136,�ΐ쌧,�����s,�������ȈՋ����{��,�A�\�E�}�`�J���C�L���E�X�C�V�Z�c,,,�ΐ쌧�����s������,,37.01056,137.02113,,,,,,,,,,,,
172022,120000137,�ΐ쌧,�����s,�����_��,�^�l�_��,,,�ΐ쌧�����s������,,36.98475,136.9643,,,,,,,,,,,,
172022,120000138,�ΐ쌧,�����s,��є_������,���J�o���V�m�E�\���R�E�G��,,,�ΐ쌧�����s��ђ��땔13�Ԓn,,36.99961,136.9293,,,,,,,,,,,,
172022,120000139,�ΐ쌧,�����s,�]���_������,�G�m�g�}���m�E�\���R�E�G��,,,�ΐ쌧�����s�]�����k��17�Ԓn,,37.06571,137.0517,,,,,,,,,,,,
172022,120000140,�ΐ쌧,�����s,�ѐ�_������,�C�K���m�E�\���R�E�G��,,,�ΐ쌧�����s�ѐ쒬�P��50�Ԓn1,,37.00505,136.9393,,,,,,,,,,,,
172022,120000141,�ΐ쌧,�����s,����_������,�N���T�L�m�E�\���R�E�G��,,,�ΐ쌧�����s���蒬��1��2�Ԓn1,,36.99119,137.0516,,,,,,,,,,,,