�s���{���R�[�h���͎s�撬���R�[�h,NO,�s���{����,�s�撬����,����,����_�J�i,����_�ʏ�,����_�p��,����������,���,�ꏊ����,�Z��,����,�ܓx,�o�x,�d�b�ԍ�,�����ԍ�,�����i���j,�����i�P�ʁj,�@�l�ԍ�,���L�ғ�,�������w���,���p�\�j��,�J�n����,�I������,���p�\�������L����,�摜,�摜_���C�Z���X,�T�v,�T�v_�p��,����,����_�p��,URL,���l
172022,40000001,�ΐ쌧,�����s,���Ô�Ð_�Ж{�a �����D,�t�W�c�q�R�W���W���z���f���c�P�^�����l�t�_,,,�d�v������,������,,�ΐ쌧�����s����������,,,,,,1,��,,���Ô�Ð_��,1967/6/15,,,,,,,,,,,,
172022,40000002,�ΐ쌧,�����s,����ƏZ��,�U�X�P�W���E�^�N,,,�d�v������,������,,�ΐ쌧�����s����������,,,,,,1,��,,�l,1971/12/28,,,,,,,,,,,,
172022,40000003,�ΐ쌧,�����s,�O�c���t�摜,�}�G�_�g�V�n���K�]�E,,,�d�v������,���p�H�|�i,�ΐ쌧�������p��,�ΐ쌧�����s���ێR��P�|�P,,37.044893,136.953702,,,1,��,,���,1950/8/29,,,,,,,,,,,,
172022,40000004,�ΐ쌧,�����s,���ω�����,�Z���W���J���m���U�]�E,,,�d�v������,���p�H�|�i,,,,,,,,1,��,,�C�厛,2012/9/6,,,,,,,,,,,,
172022,40000005,�ΐ쌧,�����s,�ؑ� �v�����v�s���ǉ��u��Ð_����,���N�]�E�N�}�J�u�g�A���J�V�q�R�m�J�~�U�]�E,,,�d�v������,���p�H�|�i,,�ΐ쌧�����s�������{�O,,,,,,1,��,,�v�����v�s���ǉ��u��Ð_��,1950/8/29,,,,,,,,,,,,
172022,40000006,�ΐ쌧,�����s,����ɎO����,�A�~�_�T���]���]�E,,,�d�v������,���p�H�|�i,�ΐ쌧�������p��,�ΐ쌧�����s���ێR��P�|�P,,37.044893,136.953702,,,1,��,,���O��,1955/2/2,,,,,,,,,,,,
172022,40000007,�ΐ쌧,�����s,���Ղ̉g�R�s��,�Z�C�n�N�T�C�m�q�L���}�M���E�W,,,�d�v���`����������,���̑�,,,,,,,,,,,���Ղł��R�ۑ���,1983/1/11,,,,,,,,,,,,
172022,40000008,�ΐ쌧,�����s,�C���̉L�Ղ̏K��,�P�^�m�E�}�c���m�V���E�]�N,,,�d�v���`����������,���̑�,,,,,,,,,,,�L�Y����i�L�ߕ��j,2000/12/27,,,,,,,,,,,,
172022,40000009,�ΐ쌧,�����s,�F�b��\���Ղ̘g���s��,�N�}�J�u�g�n�c�J�}�c���m���N�o�^�M���E�W,,,�d�v���`����������,���̑�,,,,,,,,,,,���F�b�Օ�^��,1981/1/28,,,,,,,,,,,,
172022,40000010,�ΐ쌧,�����s,�������,�i�i�I�W���E�A�g,,,�L�O��,���̑�,,�ΐ쌧�����s�Õ{���|���É��~������@�O,,,,,,,,,�����s�@��,1934/12/28,,,,,,,,,,,,
172022,40000011,�ΐ쌧,�����s,�\�o�������� �������Q��,�m�g�R�N�u���W�A�g�@�c�P�^���^�e���m�O���A�g,,,�L�O��,���̑�,,�ΐ쌧�����s�������A�Õ{��,,,,,,,,,�����s,1974/12/23,,,,,,,,,,,,
172022,40000012,�ΐ쌧,�����s,���s���,�}���M���E�C�Z�L,,,�L�O��,���̑�,,�ΐ쌧�����s���s��,,,,,,,,,�����s,2003/8/27,,,,,,,,,,,,
172022,40000013,�ΐ쌧,�����s,�{�]�ڈΌ��Õ�,�X�\�G�]�A�i�R�t��,,,�L�O��,���̑�,,�ΐ쌧�����s�\�o���{�]��,,,,,,,,,�����s,1981/1/27,,,,,,,,,,,,
172022,40000014,�ΐ쌧,�����s,�k�������X�剮,�L�^�W�}���`���e���I����,,,���o�^�L�`������,������,,�ΐ쌧�����s��{����,,,,,,,,,�l,2004/11/29,,,,,,,,,,,,
172022,40000015,�ΐ쌧,�����s,��c�ƏZ��i�����[�����j�剮,�^�_�P�W���E�^�N�i�L���E�E�G�m�P�C�u���h�E�j�I����,,,���o�^�L�`������,������,,�ΐ쌧�����s��{����,,,,,,,,,�l,2004/11/29,,,,,,,,,,,,
172022,40000016,�ΐ쌧,�����s,�����ݖ��X�剮,�g���C�V���E���e���I����,,,���o�^�L�`������,������,,�ΐ쌧�����s��{����,,,,,,,,,�l,2004/11/29,,,,,,,,,,,,
172022,40000017,�ΐ쌧,�����s,���V�낤�����X�剮,�^�J�U�����E�\�N�e���I����,,,���o�^�L�`������,������,,�ΐ쌧�����s��{����,,,,,,,,,�l,2004/11/29,,,,,,,,,,,,
172022,40000018,�ΐ쌧,�����s,�_��ƏZ��剮,�J���m�P�W���E�^�N�I����,,,���o�^�L�`������,������,,�ΐ쌧�����s�h�t��,,,,,,,,,�l,2005/12/5,,,,,,,,,,,,
172022,40000019,�ΐ쌧,�����s,���{�ƏZ��剮,�J�c���g�P�W���E�^�N�I����,,,���o�^�L�`������,������,,�ΐ쌧�����s��{����,,,,,,,,,�l,2005/12/5,,,,,,,,,,,,
172022,40000020,�ΐ쌧,�����s,�t���𑢓X�剮,�n���i���V���]�E�e���I����,,,���o�^�L�`������,������,,�ΐ쌧�����s����,,,,,,,,,�l,2005/12/27,,,,,,,,,,,,
172022,40000021,�ΐ쌧,�����s,���Êفi���ѓc�ƏZ��j�剮,�J�C�R�J���i�L���E�C�C�_�P�W���E�^�N�j�I����,,,���o�^�L�`������,������,,�ΐ쌧�����s�É��~��,,,,,,,,,�����s,2006/4/12,,,,,,,,,,,,
172022,40000022,�ΐ쌧,�����s,�ԑq�ƏZ��剮,�A�J�N���P�W���E�^�N�I����,,,���o�^�L�`������,������,,�ΐ쌧�����s����,,,,,,,,,�l,2008/7/23,,,,,,,,,,,,
172022,40000023,�ΐ쌧,�����s,���؉ƏZ��剮,�����L�P�W���E�^�N�I����,,,���o�^�L�`������,������,,�ΐ쌧�����s�������l�c,,,,,,,,,�l,2005/12/27,,,,,,,,,,,,
172022,40000024,�ΐ쌧,�����s,���؉ƏZ�� ��y�ѕ�,�����L�P�W���E�^�N�����I���r�w�C,,,���o�^�L�`������,������,,�ΐ쌧�����s�������l�c,,,,,,,,,�l,2006/3/23,,,,,,,,,,,,
172022,40000025,�ΐ쌧,�����s,�t�؉��m�i�X�i���t�؉����X�m�����j,�n���L�����E�t�N�e���i�L���E�n���L���V���E�e�����E�t�N�u�j,,,���o�^�L�`������,������,,�ΐ쌧�����s�O����,,,,,,,,,�l,2014/10/7,,,,,,,,,,,,
172022,40000026,�ΐ쌧,�����s,���R���ݖ��X�X�܌��剮,�I���}���V���E���e���e���|�P���I����,,,���o�^�L�`������,������,,�ΐ쌧�����s������,,,,,,,,,�l,2017/10/27,,,,,,,,,,,,
172022,40000027,�ΐ쌧,�����s,���R���ݖ��X�\�y��,�I���}���V���E���e���I���e�h�]�E,,,���o�^�L�`������,������,,�ΐ쌧�����s������,,,,,,,,,�l,2017/10/27,,,,,,,,,,,,
172022,40000028,�ΐ쌧,�����s,���R���ݖ��X����,�I���}���V���E���e������,,,���o�^�L�`������,������,,�ΐ쌧�����s������,,,,,,,,,�l,2017/10/27,,,,,,,,,,,,
172022,40000029,�ΐ쌧,�����s,���R���ݖ��X�ݖ���,�I���}���V���E���e���V���E���O��,,,���o�^�L�`������,������,,�ΐ쌧�����s������,,,,,,,,,�l,2017/10/27,,,,,,,,,,,,
172022,40000030,�ΐ쌧,�����s,�ю��q�a�i�a�q��֓a�{�a�j,�Z�C�����W�L���N�f���i���N���S�x���f���z���f���j,,,���o�^�L�`������,������,,�ΐ쌧�����s�a�q��,,,,,,,,,�ю�,2017/10/27,,,,,,,,,,,,
172022,40000031,�ΐ쌧,�����s,�M�s�����@�i�a�q��֓a����a�j,�W���M���E�W�V���C���i���N���S�x���f���O�u�f���j,,,���o�^�L�`������,������,,�ΐ쌧�����s�a�q��,,,,,,,,,�M�s��,2017/10/27,,,,,,,,,,,,
172022,40000032,�ΐ쌧,�����s,����v�l�摜,�`���E���C�t�W���K�]�E,,,���w��L�`������,���p�H�|�i,�ΐ쌧�������p��,�ΐ쌧�����s���ێR��P�|�P,,37.044893,136.953702,,,1,��,,���,1969/3/19,,,,,,,,,,,,
172022,40000033,�ΐ쌧,�����s,�O�����}�},�T���]�����C�S�E�Y,,,���w��L�`������,���p�H�|�i,�ΐ쌧�������p��,�ΐ쌧�����s���ێR��P�|�P,,37.044893,136.953702,,,1,��,,���O��,1970/11/25,,,,,,,,,,,,
172022,40000034,�ΐ쌧,�����s,�B���},�_���}�Y,,,���w��L�`������,���p�H�|�i,�ΐ쌧�������p��,�ΐ쌧�����s���ێR��P�|�P,,37.044893,136.953702,,,1,��,,���厛,1978/7/13,,,,,,,,,,,,
172022,40000035,�ΐ쌧,�����s,�\�Z�����},�W���E���N���J���Y,,,���w��L�`������,���p�H�|�i,�ΐ쌧�����p��,�ΐ쌧����s�o�H���Q?�P,,36.560181,136.661169,,,8,��,,�ː�,1978/7/13,,,,,,,,,,,,
172022,40000036,�ΐ쌧,�����s,���o���_��瑐},�C���j���N�~���E�W���X�C�W���N�Y,,,���w��L�`������,���p�H�|�i,�ΐ쌧�������p��,�ΐ쌧�����s���ێR��P�|�P,,37.044893,136.953702,,,1,��,,���o�_��,1980/7/10,,,,,,,,,,,,
172022,40000037,�ΐ쌧,�����s,���������},�A�^�S�S���Q���Y,,,���w��L�`������,���p�H�|�i,�ΐ쌧�������p��,�ΐ쌧�����s���ێR��P�|�P,,37.044893,136.953702,,,1,��,,�����s,1996/4/9,,,,,,,,,,,,
172022,40000038,�ΐ쌧,�����s,��ΐ��},�`���C�L�C�X�C�Y,,,���w��L�`������,���p�H�|�i,�ΐ쌧�������p��,�ΐ쌧�����s���ێR��P�|�P,,37.044893,136.953702,,,1,��,,�����s,2005/3/25,,,,,,,,,,,,
172022,40000039,�ΐ쌧,�����s,�P�������},�[���j�������E�I�E�Y,,,���w��L�`������,���p�H�|�i,�ΐ쌧�������p��,�ΐ쌧�����s���ێR��P�|�P,,37.044893,136.953702,,,1,��,,�����s,2005/3/25,,,,,,,,,,,,
172022,40000040,�ΐ쌧,�����s,���ϐ},�l�n���Y,,,���w��L�`������,���p�H�|�i,,�ΐ쌧�����s������,,,,,,1,��,,���掛,2014/1/10,,,,,,,,,,,,
172022,40000041,�ΐ쌧,�����s,���{�n�� ���ː}�����@���J�쓙���M�@��Ȉ�� ,�V�z���{�N�K�G���R�E�Y�r���E�u�n�Z�K���g�E�n�N�q�c�j�L���N�C�b�Z�L,,,���w��L�`������,���p�H�|�i,�ΐ쌧�������p��,�ΐ쌧�����s���ێR��P�|�P,,37.044893,136.953702,,,,,,�����s,2018/1/30,,,,,,,,,,,,
172022,40000042,�ΐ쌧,�����s,���{�n�� ���|�}�����@���J�쓙���M�@��Ȉ�� ,�V�z���{�N�K�V���E�`�N�Y�r���E�u�n�Z�K���g�E�n�N�q�c�j�L���N�C�b�Z�L,,,���w��L�`������,���p�H�|�i,�ΐ쌧�������p��,�ΐ쌧�����s���ێR��P�|�P,,37.044893,136.953702,,,,,,�����s,2018/1/30,,,,,,,,,,,,
172022,40000043,�ΐ쌧,�����s,����ɔ@������,�A�~�_�j�����C�U�]�E,,,���w��L�`������,���p�H�|�i,,�ΐ쌧�����s������,,,,,,1,��,,���ω@,2011/2/1,,,,,,,,,,,,
172022,40000044,�ΐ쌧,�����s,�ؑ� ��t�@������,���N�]�E���N�V�������C�U�]�E,,,���w��L�`������,���p�H�|�i,,�ΐ쌧�����s�������{�O,,,,,,1,��,,�v�����v�s���ǉ��u��Ð_��,1985/4/5,,,,,,,,,,,,
172022,40000045,�ΐ쌧,�����s,�ؑ� ���_����,���N�]�E�Y�C�V���U�]�E,,,���w��L�`������,���p�H�|�i,�������Ղ莑���فE���Ղ�`����,�ΐ쌧�����s���������c�P?�P�S�W,,37.129104,136.832432,,,2,��,,�v�����v�s���ǉ��u��Ð_��,2021/12/24,,,,,,,,,,,,
172022,40000046,�ΐ쌧,�����s,���@�ᑠ�A�`���^�E���@�ᑠ���c�呥 �� �[����,�V���E�z�E�Q���]�E�A�f���R�E���N�E�V���E�z�E�Q���]�E�u�b�\�S�\�N�@�c�P�^���@�m�E�j���E�o�R,,,���w��L�`������,���p�H�|�i,�ΐ쌧�������p��,�ΐ쌧�����s���ێR��P�|�P,,37.044893,136.953702,,,82,��,,���厛,1983/1/25,,,,,,,,,,,,
172022,40000047,�ΐ쌧,�����s,�����D�A��,�t�X�i�j�t�l�����K,,,���w��L�`������,���p�H�|�i,�ΐ쌧�������p��,�ΐ쌧�����s���ێR��P�|�P,,37.044893,136.953702,,,1,��,,�����s,2000/3/14,,,,,,,,,,,,
172022,40000048,�ΐ쌧,�����s,�ɖ�����_�Г��D,�C���q���W���W�����i�t�_,,,���w��L�`������,���p�H�|�i,,�ΐ쌧�����s�\�o�����c��,,,,,,32,��,,�ɖ�����_�Ё@,1983/1/25,,,,,,,,,,,,
172022,40000049,�ΐ쌧,�����s,�\�o�̐z�K�Ղ�̊��ł��_��,�m�g�m�X���}�c���m�J�}�E�`�V���W,,,���w�薳�`����������,���̑�,,,,,,,,,,,�����̊��Ղ�ۑ���,1992/10/9,,,,,,,,,,,,
172022,40000050,�ΐ쌧,�����s,�\�o�����c�̉΍�,�m�g�W�}�R�E�_�m�q�}�c��,,,���w�薳�`����������,���̑�,,,,,,,,,,,�\�o�����c�̉΍Օۑ���,1987/1/14,,,,,,,,,,,,
172022,40000051,�ΐ쌧,�����s,�����܂���,�i�i�I�}�_��,,,���w�薳�`����������,�|�\,,,,,,,,,,,�����܂���t����,1966/7/8,,,,,,,,,,,,
172022,40000052,�ΐ쌧,�����s,�@�����g�ˌÕ�,�C���i�C�`���N�V�d�J�R�t��,,,���w��L�O��,���̑�,,�ΐ쌧�����s����,,,,,,1,��,,�����s,1972/3/21,,,,,,,,,,,,
172022,40000053,�ΐ쌧,�����s,�ԑ��R,�A�J�N�����},,,���w��L�O��,���̑�,,�ΐ쌧�����s�O����,,,,,,,,,�ԑq�_��,1991/10/4,,,,,,,,,,,,
172022,40000054,�ΐ쌧,�����s,�㒬�}���_���Õ��Q,�J���}�`�}���_���R�t���O��,,,���w��L�O��,���̑�,,�ΐ쌧�����s�������㒬,,,,,,2,��,,�����s,1980/10/7,,,,,,,,,,,,
172022,40000055,�ΐ쌧,�����s,�ѐ�̃q���h���U�N��,�C�K���m�q���h���U�N��,,,���w��L�O��,���̑�,,�ΐ쌧�����s�ѐ쒬,,,,,,,,,�l,1972/8/23,,,,,,,,,,,,
172022,40000056,�ΐ쌧,�����s,�ɉe�R�_�Ђ̃C�`���E,�C�J�Q���}�W���W���m�C�`���E,,,���w��L�`������,���̑�,,�ΐ쌧�����s����,,,,,,,,,�ɉe�R�_��,1990/9/26,,,,,,,,,,,,
172022,40000057,�ΐ쌧,�����s,�≮���Αw,�C�����J�Z�L�\�E,,,���w��L�O��,���̑�,,�ΐ쌧�����s������,,,,,,,,,�����s,1990/9/26,,,,,,,,,,,,
172022,40000058,�ΐ쌧,�����s,�����_�ЎБp�^�u��,�J���V�}�W���W���V���\�E�^�u����,,,���w��L�O��,���̑�,,�ΐ쌧�����s����������,,,,,,,,,�����_��,2002/8/27,,,,,,,,,,,,
172022,40000059,�ΐ쌧,�����s,���Ж{�a,�\�E�W���z���f��,,,�s�w��L�`������,������,,�ΐ쌧�����s�Õ{��,,,,,,1,��,,�Õ{����,1979/6/21,,,,,,,,,,,,
172022,40000060,�ΐ쌧,�����s,�F��_�Ж{�a,�N�}�m�W���W���z���f��,,,�s�w��L�`������,������,,�ΐ쌧�����s��c��,,,,,,1,��,,�F��_�Ў��q�ꓯ,1979/6/21,,,,,,,,,,,,
172022,40000061,�ΐ쌧,�����s,���g�_�Ж{�a,�q���V�W���W���z���f��,,,�s�w��L�`������,������,,�ΐ쌧�����s��c��,,,,,,1,��,,���g�_�Ў��q�ꓯ,1979/6/21,,,,,,,,,,,,
172022,40000062,�ΐ쌧,�����s,�������ΐ_�Ж{�a,�~���E�P���V���C�V�W���W���z���f��,,,�s�w��L�`������,������,,�ΐ쌧�����s��쒬,,,,,,1,��,,��쒬��,1979/6/21,,,,,,,,,,,,
172022,40000063,�ΐ쌧,�����s,���䎛�{��,�g�E���C�W�z���h�E,,,�s�w��L�`������,������,,�ΐ쌧�����s�c�ߕl��,,,,,,1,��,,���䎛,1988/6/6,,,,,,,,,,,,
172022,40000064,�ΐ쌧,�����s,���䎛�R��,�g�E���C�W�T������,,,�s�w��L�`������,������,,�ΐ쌧�����s�c�ߕl��,,,,,,1,��,,���䎛,1988/6/6,,,,,,,,,,,,
172022,40000065,�ΐ쌧,�����s,�ԑq�_�Дq�a,�A�J�N���W���W���n�C�f��,,,�s�w��L�`������,������,,�ΐ쌧�����s�O����,,,,,,1,��,,�ԑq�_��,1989/3/9,,,,,,,,,,,,
172022,40000066,�ΐ쌧,�����s,�ԑq�_�Ж{�a,�A�J�N���W���W���z���f��,,,�s�w��L�`������,������,,�ΐ쌧�����s�O����,,,,,,1,��,,�ԑq�_��,1989/3/9,,,,,,,,,,,,
172022,40000067,�ΐ쌧,�����s,�ԑq�_�Аm����,�A�J�N���W���W���j�I�E����,,,�s�w��L�`������,������,,�ΐ쌧�����s�O����,,,,,,1,��,,�ԑq�_��,1989/3/9,,,,,,,,,,,,
172022,40000068,�ΐ쌧,�����s,���ؓ@ �剮�꓏�E�[���񓏁E�đq�꓏�E�y����,�����L�e�C,,,�s�w��L�`������,������,,�ΐ쌧�����s�������O,,,,,,,,,�����s,1963/7/29,,,,,,,,,,,,
172022,40000069,�ΐ쌧,�����s,��,�z�E�]�E,,,�s�w��L�`������,������,,�ΐ쌧�����s�������{�O,,,,,,1,��,,�v�����v�s���ǉ��u��Ð_��,1972/3/23,,,,,,,,,,,,
172022,40000070,�ΐ쌧,�����s,�߉ޟ��ϐ},�V���J�l�n�����Y,,,�s�w��L�`������,���p�H�|�i,�ΐ쌧�������p��,�ΐ쌧�����s���ێR��P�|�P,,37.044893,136.953702,,,1,��,,���O��,1958/2/24,,,,,,,,,,,,
172022,40000071,�ΐ쌧,�����s,�O�畧�摜,�T���[���u�c�K�]�E,,,�s�w��L�`������,���p�H�|�i,�ΐ쌧�������p��,�ΐ쌧�����s���ێR��P�|�P,,37.044893,136.953702,,,1,��,,���o�_��,1958/2/26,,,,,,,,,,,,
172022,40000072,�ΐ쌧,�����s,�\�O���摜,�W���E�T���u�c�K�]�E,,,�s�w��L�`������,���p�H�|�i,,�ΐ쌧�����s������,,,,,,1,��,,���ω@,1958/2/26,,,,,,,,,,,,
172022,40000073,�ΐ쌧,�����s,���@�摜,�j�`�����K�]�E,,,�s�w��L�`������,���p�H�|�i,�ΐ쌧�����p��,�ΐ쌧����s�o�H���Q?�P,,36.560181,136.661169,,,1,��,,������,1973/7/25,,,,,,,,,,,,
172022,40000074,�ΐ쌧,�����s,�O�c�����摜,�}�G�_���X�J�c�K�]�E,,,�s�w��L�`������,���p�H�|�i,�ΐ쌧�������p��,�ΐ쌧�����s���ێR��P�|�P,,37.044893,136.953702,,,1,��,,���,1977/2/25,,,,,,,,,,,,
172022,40000075,�ΐ쌧,�����s,�O�c�����摜,�}�G�_�g�V�}�T�K�]�E,,,�s�w��L�`������,���p�H�|�i,�ΐ쌧�������p��,�ΐ쌧�����s���ێR��P�|�P,,37.044893,136.953702,,,1,��,,���,1977/2/25,,,,,,,,,,,,
172022,40000076,�ΐ쌧,�����s,���{���F ���ϐ}�@���J�쓙�_�M�@�ꕝ,�V�z���`���V���N�l�n���Y,,,�s�w��L�`������,���p�H�|�i,,�ΐ쌧�����s������,,,,,,1,��,,�{����,1978/4/1,,,,,,,,,,,,
172022,40000077,�ΐ쌧,�����s,���{���`�W�� ���ϐ}�͖{�@���J�쓙�_�M�@�ꕝ,�V�z���n�N�r���E�^���T�C�l�n���Y���z���n�Z�K���g�E���q�c,,,�s�w��L�`������,���p�H�|�i,�ΐ쌧�������p��,�ΐ쌧�����s���ێR��P�|�P,,37.044893,136.953702,,,1,��,,���@��,1978/4/1,,,,,,,,,,,,
172022,40000078,�ΐ쌧,�����s,�F�؍��ߏ��Č��ё�,�N�}�L�T�R���V���E�Q���R�E�V���E�]�E,,,�s�w��L�`������,���p�H�|�i,,�ΐ쌧�����s����������,,,,,,1,��,,��ю�,1979/12/3,,,,,,,,,,,,
172022,40000079,�ΐ쌧,�����s,壎R�����T�t���^�摜,�P�C�U���W���E�L���[���W�W�T���K�]�E,,,�s�w��L�`������,���p�H�|�i,,�ΐ쌧�����s�c�ߕl��,,,,,,1,��,,���䎛,1997/5/12,,,,,,,,,,,,
172022,40000080,�ΐ쌧,�����s,���ϐ},�l�n���Y,,,�s�w��L�`������,���p�H�|�i,,�ΐ쌧�����s�c�ߕl��,,,,,,1,��,,���䎛,2004/9/20,,,,,,,,,,,,
172022,40000081,�ΐ쌧,�����s,�\�Z�����},�W���E���N���J���Y,,,�s�w��L�`������,���p�H�|�i,�ΐ쌧�������p��,�ΐ쌧�����s���ێR��P�|�P,,37.044893,136.953702,,,2,��,,�x�Վ�,2004/9/20,,,,,,,,,,,,
172022,40000082,�ΐ쌧,�����s,���D�A��,�`���E���V�c���]�E,,,�s�w��L�`������,���p�H�|�i,�ΐ쌧�������p��,�ΐ쌧�����s���ێR��P�|�P,,37.044893,136.953702,,,1,��,,�x�Վ�,2004/9/20,,,,,,,,,,,,
172022,40000083,�ΐ쌧,�����s,���{�n�� �W�ʁ@�R���}�@���J�쓙�_�M�@�ꕝ,�V�z���{�N�K�^���T�C�T���X�C�Y,,,�s�w��L�`������,���p�H�|�i,�ΐ쌧�������p��,�ΐ쌧�����s���ێR��P�|�P,,37.044893,136.953702,,,,,,�����s,2014/8/29,,,,,,,,,,,,
172022,40000084,�ΐ쌧,�����s,���{���F ���ϐ}�@���J��M�t�i�����j�M�@�ꕝ ,�V�z���`���V���N�l�n���Y,,,�s�w��L�`������,���p�H�|�i,�ΐ쌧�������p��,�ΐ쌧�����s���ێR��P�|�P,,37.044893,136.953702,,,,,,�����s,2014/8/29,,,,,,,,,,,,
172022,40000085,�ΐ쌧,�����s,���ω�����,�V���E�J���m�����E�]�E,,,�s�w��L�`������,���p�H�|�i,,�ΐ쌧�����s������,,,,,,1,��,,���ω@,1958/2/26,,,,,,,,,,,,
172022,40000086,�ΐ쌧,�����s,��V����,�j�e�������E�]�E,,,�s�w��L�`������,���p�H�|�i,,�ΐ쌧�����s������,,,,,,2,��,,���ω@,1958/2/26,,,,,,,,,,,,
172022,40000087,�ΐ쌧,�����s,�n����F����,�W�]�E�{�T�c�����E�]�E,,,�s�w��L�`������,���p�H�|�i,,�ΐ쌧�����s������,,,,,,1,��,,���ω@,1958/2/26,,,,,,,,,,,,
172022,40000088,�ΐ쌧,�����s,���@����,�j�`�����U�\�E,,,�s�w��L�`������,���p�H�|�i,,�ΐ쌧�����s������,,,,,,1,��,,�{����,1973/7/25,,,,,,,,,,,,
172022,40000089,�ΐ쌧,�����s,�ؑ� ���ω������@���,���N�]�E�V���E�J���m�������E�]�E,,,�s�w��L�`������,���p�H�|�i,,�ΐ쌧�����s���쒬,,,,,,,,,���쒬��,1999/11/29,,,,,,,,,,,,
172022,40000090,�ΐ쌧,�����s,���i�A��,�`���E�J�Q�c���]�E,,,�s�w��L�`������,���p�H�|�i,,�ΐ쌧�����s�O����,,,,,,1,��,,�ԑq�_��,2004/9/20,,,,,,,,,,,,
172022,40000091,�ΐ쌧,�����s,�S��,�I�j�K����,,,�s�w��L�`������,���p�H�|�i,,�ΐ쌧�����s�O����,,,,,,1,��,,�ԑq�_��,2004/9/20,,,,,,,,,,,,
172022,40000092,�ΐ쌧,�����s,���q��,�V�V�K�V��,,,�s�w��L�`������,���p�H�|�i,,�ΐ쌧�����s�O����,,,,,,1,��,,�ԑq�_��,2004/9/20,,,,,,,,,,,,
172022,40000093,�ΐ쌧,�����s,��k��,�W�W�o�o����,,,�s�w��L�`������,���p�H�|�i,,�ΐ쌧�����s�O����,,,,,,2,��,,�ԑq�_��,2004/9/20,,,,,,,,,,,,
172022,40000094,�ΐ쌧,�����s,����ɔ@������,�A�~�_�j�����C�U�]�E,,,�s�w��L�`������,���p�H�|�i,,�ΐ쌧�����s�O����,,,,,,1,��,,�ԑq�_��,2004/9/20,,,,,,,,,,,,
172022,40000095,�ΐ쌧,�����s,�ω�����,�J���m�������E�]�E,,,�s�w��L�`������,���p�H�|�i,,�ΐ쌧�����s�c�ߕl��,,,,,,1,��,,���䎛,2004/9/20,,,,,,,,,,,,
172022,40000096,�ΐ쌧,�����s,���P�@�ω�,�E�V�K�n�i�J���m��,,,�s�w��L�`������,���p�H�|�i,,�ΐ쌧�����s�O����,,,,,,1,��,,���l����,2004/9/20,,,,,,,,,,,,
172022,40000097,�ΐ쌧,�����s,���_��,�Y�C�V���]�E,,,�s�w��L�`������,���p�H�|�i,,�ΐ쌧�����s��Ò�,,,,,,1,��,,��Ô����_��,2004/9/20,,,,,,,,,,,,
172022,40000098,�ΐ쌧,�����s,����,�R�}�C�k,,,�s�w��L�`������,���p�H�|�i,,�ΐ쌧�����s��Ò�,,,,,,1,��,,��Ô����_��,2004/9/20,,,,,,,,,,,,
172022,40000099,�ΐ쌧,�����s,���_��,�Y�C�V���]�E,,,�s�w��L�`������,���p�H�|�i,,�ΐ쌧�����s���X��,,,,,,1,��,,�΋{�_��,2004/9/20,,,,,,,,,,,,
172022,40000100,�ΐ쌧,�����s,����,�R�}�C�k,,,�s�w��L�`������,���p�H�|�i,,�ΐ쌧�����s���X��,,,,,,1,��,,�΋{�_��,2004/9/20,,,,,,,,,,,,
172022,40000101,�ΐ쌧,�����s,�ؑ� �߉ގO����,���N�]�E�V���J�T���]���]�E,,,�s�w��L�`������,���p�H�|�i,,�ΐ쌧�����s�������L�c��,,,,,,1,��,,�l,1966/5/23,,,,,,,,,,,,
172022,40000102,�ΐ쌧,�����s,�ؑ� ���ϐ�����F����,���N�]�E�V���E�J���[�I���{�T�c�����E�]�E,,,�s�w��L�`������,���p�H�|�i,,�ΐ쌧�����s�������}�t,,,,,,1,��,,���}�t����,1966/5/23,,,,,,,,,,,,
172022,40000103,�ΐ쌧,�����s,�ؑ� ����,���N�]�E�R�}�C�k,,,�s�w��L�`������,���p�H�|�i,,�ΐ쌧�����s�������{�O,,,,,,1,��,,�v�����v�s���ǉ��u��Ð_��,1966/5/23,,,,,,,,,,,,
172022,40000104,�ΐ쌧,�����s,�ؑ� ���h���q��,���N�]�E�E���V�k���V�V�K�V��,,,�s�w��L�`������,���p�H�|�i,�������Ղ莑���فE���Ղ�`����,�ΐ쌧�����s���������c�P?�P�S�W,,37.129104,136.832432,,,1,��,,�v�����v�s���ǉ��u��Ð_��,1987/3/4,,,,,,,,,,,,
172022,40000105,�ΐ쌧,�����s,���c�F��,�T���^�q�R����,,,�s�w��L�`������,���p�H�|�i,�������Ղ莑���فE���Ղ�`����,�ΐ쌧�����s���������c�P?�P�S�W,,37.129104,136.832432,,,1,��,,�v�����v�s���ǉ��u��Ð_��,1987/3/4,,,,,,,,,,,,
172022,40000106,�ΐ쌧,�����s,����,�I�L�i����,,,�s�w��L�`������,���p�H�|�i,�������Ղ莑���فE���Ղ�`����,�ΐ쌧�����s���������c�P?�P�S�W,,37.129104,136.832432,,,1,��,,�v�����v�s���ǉ��u��Ð_��,1987/3/4,,,,,,,,,,,,
172022,40000107,�ΐ쌧,�����s,�[��,�I�E�i����,,,�s�w��L�`������,���p�H�|�i,�������Ղ莑���فE���Ղ�`����,�ΐ쌧�����s���������c�P?�P�S�W,,37.129104,136.832432,,,1,��,,�v�����v�s���ǉ��u��Ð_��,1987/3/4,,,,,,,,,,,,
172022,40000108,�ΐ쌧,�����s,�ؑ� ���q��,���N�]�E�V�V�K�V��,,,�s�w��L�`������,���p�H�|�i,�������Ղ莑���فE���Ղ�`����,�ΐ쌧�����s���������c�P?�P�S�W,,37.129104,136.832432,,,1,��,,�����_��,1989/11/21,,,,,,,,,,,,
172022,40000109,�ΐ쌧,�����s,�ؑ� �߉ޔ@������,���N�]�E�V���J�j�����C�U�]�E,,,�s�w��L�`������,���p�H�|�i,,�ΐ쌧�����s����������,,,,,,1,��,,��ю�,2000/6/29,,,,,,,,,,,,
172022,40000110,�ΐ쌧,�����s,�ؑ� �����F����,���N�]�E�����W���{�T�c�U�]�E,,,�s�w��L�`������,���p�H�|�i,,�ΐ쌧�����s����������,,,,,,1,��,,��ю�,2000/6/29,,,,,,,,,,,,
172022,40000111,�ΐ쌧,�����s,�ؑ� ������F����,���N�]�E�t�Q���{�T�c�U�]�E,,,�s�w��L�`������,���p�H�|�i,,�ΐ쌧�����s����������,,,,,,1,��,,��ю�,2000/6/29,,,,,,,,,,,,
172022,40000112,�ΐ쌧,�����s,�ؑ� ���Y�@������,���N�]�E�Q�b�|�\�E�Z���U�]�E,,,�s�w��L�`������,���p�H�|�i,,�ΐ쌧�����s����������,,,,,,1,��,,��ю�,2000/6/29,,,,,,,,,,,,
172022,40000113,�ΐ쌧,�����s,�ؑ� �j�_����,���N�]�E�_���V���U�]�E,,,�s�w��L�`������,���p�H�|�i,,�ΐ쌧�����s�\�o�����c��,,,,,,4,��,,�ɖ�����_��,1974/11/5,,,,,,,,,,,,
172022,40000114,�ΐ쌧,�����s,�ؑ� �j�_���_����,���N�]�E�_���V���j���V���U�]�E,,,�s�w��L�`������,���p�H�|�i,,�ΐ쌧�����s�\�o���Ȓ�,,,,,,14,��,,��{�_��,1974/11/5,,,,,,,,,,,,
172022,40000115,�ΐ쌧,�����s,�ؑ� ���_���� ,���N�]�E���K�~�U�]�E,,,�s�w��L�`������,���p�H�|�i,,�ΐ쌧�����s�\�o���c��P�Y��,,,,,,1,��,,�ꐳ��,1974/11/5,,,,,,,,,,,,
172022,40000116,�ΐ쌧,�����s,�ؑ� ��t�@������,���N�]�E���N�V�j�����C�����E�]�E,,,�s�w��L�`������,���p�H�|�i,,�ΐ쌧�����s�\�o���c��P�Y��,,,,,,1,��,,�ꐳ��,1974/11/5,,,,,,,,,,,,
172022,40000117,�ΐ쌧,�����s,�ؑ� ���_��,���N�]�E�Y�C�V���]�E,,,�s�w��L�`������,���p�H�|�i,,�ΐ쌧�����s�\�o�����Y��,,,,,,2,��,,�ĎR�_��,1974/11/5,,,,,,,,,,,,
172022,40000118,�ΐ쌧,�����s,�ؑ� �j�_���_���� ,���N�]�E�_���V���j���V���U�]�E,,,�s�w��L�`������,���p�H�|�i,,�ΐ쌧�����s�\�o�����Y��,,,,,,10,��,,�ĎR�_��,1974/11/5,,,,,,,,,,,,
172022,40000119,�ΐ쌧,�����s,�ؑ� ������V����,���N�]�E�r�V�������e�������E�]�E,,,�s�w��L�`������,���p�H�|�i,,�ΐ쌧�����s�\�o���ʏ���,,,,,,1,��,,�ʏ��_��,1974/11/5,,,,,,,,,,,,
172022,40000120,�ΐ쌧,�����s,�ؑ� ��F�`����,���N�]�E�{�T�c�K�^�����E�]�E,,,�s�w��L�`������,���p�H�|�i,,�ΐ쌧�����s�\�o����蒬,,,,,,3,��,,��{�_��,1974/11/5,,,,,,,,,,,,
172022,40000121,�ΐ쌧,�����s,�ؑ� �O�_��,���N�]�E�T���V���]�E,,,�s�w��L�`������,���p�H�|�i,,�ΐ쌧�����s�\�o����蒬,,,,,,6,��,,��{�_��,1974/11/5,,,,,,,,,,,,
172022,40000122,�ΐ쌧,�����s,�ؑ� ���ω�����,���N�]�E�V���E�J���m�E�U�]�E,,,�s�w��L�`������,���p�H�|�i,,�ΐ쌧�����s�\�o��聒�,,,,,,1,��,,聊ω���,1974/11/5,,,,,,,,,,,,
172022,40000123,�ΐ쌧,�����s,���펪�G��,���f���}�L�G�N��,,,�s�w��L�`������,���p�H�|�i,������j������,�ΐ쌧�����s�É��~���V�J�}�M�W�Ԓn�Q,,37.024468,136.976007,,,1,��,,�v�u�ɓޑ�������_��,1973/7/25,,,,,,,,,,,,
172022,40000124,�ΐ쌧,�����s,�R����\��А_�y��,�T���m�E�j�W���E�C�b�V���J�O���X�Y,,,�s�w��L�`������,���p�H�|�i,������j������,�ΐ쌧�����s�É��~���V�J�}�M�W�Ԓn�Q,,37.024468,136.976007,,,1,��,,��n��_��,1977/2/25,,,,,,,,,,,,
172022,40000125,�ΐ쌧,�����s,����������,�T�C�R�E�W�{���V���E,,,�s�w��L�`������,���p�H�|�i,,�ΐ쌧�����s������,,,,,,1,��,,������,1977/2/25,,,,,,,,,,,,
172022,40000126,�ΐ쌧,�����s,���掛����,�`���E�W���W�{���V���E,,,�s�w��L�`������,���p�H�|�i,,�ΐ쌧�����s������,,,,,,1,��,,���掛,1977/2/25,,,,,,,,,,,,
172022,40000127,�ΐ쌧,�����s,�C�厛����,�J�C�����W�{���V���E,,,�s�w��L�`������,���p�H�|�i,,�ΐ쌧�����s��c��,,,,,,1,��,,�C�厛,1977/2/25,,,,,,,,,,,,
172022,40000128,�ΐ쌧,�����s,�@���L,�z���K�C,,,�s�w��L�`������,���p�H�|�i,,�ΐ쌧�����s�O����,,,,,,2,��,,�ԑq�_��,2004/9/20,,,,,,,,,,,,
172022,40000129,�ΐ쌧,�����s,�[���,�M�{�V,,,�s�w��L�`������,���p�H�|�i,,�ΐ쌧�����s�O����,,,,,,2,��,,�ԑq�_��,2004/9/20,,,,,,,,,,,,
172022,40000130,�ΐ쌧,�����s,�r�q,�w�C�V,,,�s�w��L�`������,���p�H�|�i,,�ΐ쌧�����s�O����,,,,,,2,��,,�ԑq�_��,2004/9/20,,,,,,,,,,,,
172022,40000131,�ΐ쌧,�����s,����,�{���V���E,,,�s�w��L�`������,���p�H�|�i,,�ΐ쌧�����s�O����,,,,,,1,��,,�ԑq�_��,2004/9/20,,,,,,,,,,,,
172022,40000132,�ΐ쌧,�����s,����,�����},,,�s�w��L�`������,���p�H�|�i,,�ΐ쌧�����s�c�ߕl��,,,,,,1,��,,���䎛,2004/9/20,,,,,,,,,,,,
172022,40000133,�ΐ쌧,�����s,�{����,�z���h�E�g�r��,,,�s�w��L�`������,���p�H�|�i,,�ΐ쌧�����s�c�ߕl��,,,,,,1,��,,���䎛,2004/9/20,,,,,,,,,,,,
172022,40000134,�ΐ쌧,�����s,����,�R�E�^�N,,,�s�w��L�`������,���p�H�|�i,,�ΐ쌧�����s�c�ߕl��,,,,,,1,�r,,���䎛,2004/9/20,,,,,,,,,,,,
172022,40000135,�ΐ쌧,�����s,���F,�R�E��,,,�s�w��L�`������,���p�H�|�i,,�ΐ쌧�����s�c�ߕl��,,,,,,1,��,,���䎛,2004/9/20,,,,,,,,,,,,
172022,40000136,�ΐ쌧,�����s,�ԕr,�J�r��,,,�s�w��L�`������,���p�H�|�i,,�ΐ쌧�����s�c�ߕl��,,,,,,1,��,,���䎛,2004/9/20,,,,,,,,,,,,
172022,40000137,�ΐ쌧,�����s,�K��j����,�[�j�N���E�����L���E,,,�s�w��L�`������,���p�H�|�i,,�ΐ쌧�����s�c�ߕl��,,,,,,1,��,,���䎛,2004/9/20,,,,,,,,,,,,
172022,40000138,�ΐ쌧,�����s,����,�{���V���E,,,�s�w��L�`������,���p�H�|�i,,�ΐ쌧�����s�c�ߕl��,,,,,,1,��,,���䎛,2004/9/20,,,,,,,,,,,,
172022,40000139,�ΐ쌧,�����s,����,�{���V���E,,,�s�w��L�`������,���p�H�|�i,,�ΐ쌧�����s�c�ߕl��,,,,,,1,��,,�@�厛,2004/9/20,,,,,,,,,,,,
172022,40000140,�ΐ쌧,�����s,�Ѝ��G�z,�V���S�E�w���K�N,,,�s�w��L�`������,���p�H�|�i,,�ΐ쌧�����s�g�c��,,,,,,1,��,,�g�c�C��Ð_��,2004/9/20,,,,,,,,,,,,
172022,40000141,�ΐ쌧,�����s,����_�V,�g�E���C�W���M,,,�s�w��L�`������,���p�H�|�i,,�ΐ쌧�����s�O����,,,,,,1,��,,�h�t�@,2004/9/20,,,,,,,,,,,,
172022,40000142,�ΐ쌧,�����s,�ތ�,�V���E�R,,,�s�w��L�`������,���p�H�|�i,,�ΐ쌧�����s��K��,,,,,,1,��,,�r�Δ�Ð_��,2004/9/20,,,,,,,,,,,,
172022,40000143,�ΐ쌧,�����s,���G��,�}�L�G�N��,,,�s�w��L�`������,���p�H�|�i,�������Ղ莑���فE���Ղ�`����,�ΐ쌧�����s���������c�P?�P�S�W,,37.129104,136.832432,,,1,��,,���Ô�Ð_��,1966/5/23,,,,,,,,,,,,
172022,40000144,�ΐ쌧,�����s,�I�ꑷ�O��i�����U��,�}�g�o�}�S�\�L�V���V�W���E�Q�T,,,�s�w��L�`������,���p�H�|�i,,�ΐ쌧�����s�������͍�,,,,,,1,�_,,���Ǝ�,1985/4/10,,,,,,,,,,,,
172022,40000145,�ΐ쌧,�����s,���Ǝ�����,�g�N�V���E�W�J���V���E,,,�s�w��L�`������,���p�H�|�i,,�ΐ쌧�����s�������͍�,,,,,,1,��,,���Ǝ�,1998/3/27,,,,,,,,,,,,
172022,40000146,�ΐ쌧,�����s,�v�����v�s���ǉ��u��Ð_�� ������,�N�}�J�u�g�A���J�V�q�R�W���W�����^�e�K�},,,�s�w��L�`������,���p�H�|�i,�������Ղ莑���فE���Ղ�`����,�ΐ쌧�����s���������c�P?�P�S�W,,37.129104,136.832432,,,1,��,,�v�����v�s���ǉ��u��Ð_��,1998/3/27,,,,,,,,,,,,
172022,40000147,�ΐ쌧,�����s,���q���R�� ������,�I�}�L�n�N�T���V�����^�e�K�},,,�s�w��L�`������,���p�H�|�i,�������Ղ莑���فE���Ղ�`����,�ΐ쌧�����s���������c�P?�P�S�W,,37.129104,136.832432,,,1,��,,���q����,1998/3/27,,,,,,,,,,,,